[Trilinos-Users] [EXTERNAL] error attempting to compile trilinos

Perschbacher, Brent M bmpersc at sandia.gov
Mon Oct 28 10:49:19 MDT 2013

  Could you run "make VERBOSE=1" and send me the results please? I'll take a look at them to see what the issue might be.



From: Riccardo Rossi <rrossi at cimne.upc.edu<mailto:rrossi at cimne.upc.edu>>
Date: Saturday, October 26, 2013 3:51 PM
To: "trilinos-users at software.sandia.gov<mailto:trilinos-users at software.sandia.gov>" <trilinos-users at software.sandia.gov<mailto:trilinos-users at software.sandia.gov>>
Subject: [EXTERNAL] [Trilinos-Users] error attempting to compile trilinos

Dear list,
  i just downloaded the latest 11.4.2 trilinos and i was trying to compile it.

I attach the configure file i am using.

the error i get follows at the end of the email

please note that without tests compilation is correct and the code works, at least for Amesos, AztecOO and ML.

thank you in advance for any suggestion


riccardo at rrossi-notebook:~/scratch/trilinos-11.4.2-Source/trilinos_build$ make install
[  0%] Built target last_lib
[  0%] Building CXX object packages/teuchos/core/src/CMakeFiles/teuchoscore.dir/Teuchos_Time.cpp.o
[  0%] Building CXX object packages/teuchos/core/src/CMakeFiles/teuchoscore.dir/Teuchos_ArrayView.cpp.o
[  0%] Building CXX object packages/teuchos/core/src/CMakeFiles/teuchoscore.dir/Teuchos_VerbosityLevel.cpp.o
[  0%] Building CXX object packages/teuchos/core/src/CMakeFiles/teuchoscore.dir/Teuchos_CommandLineProcessor.cpp.o
[  0%] Building CXX object packages/teuchos/core/src/CMakeFiles/teuchoscore.dir/Teuchos_Describable.cpp.o
[  0%] Building CXX object packages/teuchos/core/src/CMakeFiles/teuchoscore.dir/Teuchos_dyn_cast.cpp.o
[  0%] Building CXX object packages/teuchos/core/src/CMakeFiles/teuchoscore.dir/Teuchos_CWrapperSupport.cpp.o
[  0%] Building CXX object packages/teuchos/core/src/CMakeFiles/teuchoscore.dir/Teuchos_Ptr.cpp.o
[  0%] Building CXX object packages/teuchos/core/src/CMakeFiles/teuchoscore.dir/Teuchos_ScalarTraits.cpp.o
[  0%] Building CXX object packages/teuchos/core/src/CMakeFiles/teuchoscore.dir/Teuchos_VerboseObject.cpp.o
[  0%] Building CXX object packages/teuchos/core/src/CMakeFiles/teuchoscore.dir/Teuchos_TestForException.cpp.o
[  0%] Building CXX object packages/teuchos/core/src/CMakeFiles/teuchoscore.dir/Teuchos_TypeNameTraits.cpp.o
Linking CXX shared library libteuchoscore.so
[  1%] Built target teuchoscore
[  1%] Building CXX object packages/teuchos/core/test/CommandLineProcessor/CMakeFiles/TeuchosCore_CommandLineProcessor_test.dir/cxx_main.cpp.o
Linking CXX executable TeuchosCore_CommandLineProcessor_test.exe
/usr/bin/ld: cannot find -l-Wl,-rpath,/home/riccardo/scratch/trilinos-11.4.2-Source/trilinos_build/packages/teuchos/core/src
collect2: error: ld returned 1 exit status
make[2]: *** [packages/teuchos/core/test/CommandLineProcessor/TeuchosCore_CommandLineProcessor_test.exe] Error 1
make[1]: *** [packages/teuchos/core/test/CommandLineProcessor/CMakeFiles/TeuchosCore_CommandLineProcessor_test.dir/all] Error 2
make: *** [all] Error 2


Dr. Riccardo Rossi, Civil Engineer

Member of Kratos Team

International Center for Numerical Methods in Engineering - CIMNE
Campus Norte, Edificio C1

c/ Gran Capitán s/n

08034 Barcelona, España

Tel:        (+34) 93 401 56 96

Fax:       (+34) 93.401.6517

web:       www.cimne.com<http://www.cimne.com/>
-------------- next part --------------
An HTML attachment was scrubbed...
URL: https://software.sandia.gov/pipermail/trilinos-users/attachments/20131028/c7e5327c/attachment.html 

More information about the Trilinos-Users mailing list