[Trilinos-Users] New Bug

Bill Spotz wfspotz at sandia.gov
Thu Mar 5 11:14:21 MST 2009


Matt,

Look in /homeA/home3/u27/mgoodman/build/trilinos/trilinos-9.0.2/ 
packages/PyTrilinos/shared.  Is there a libteuchos.so in there?

The PyTrilinos build system is a bit of a hybrid of autotools and the  
python distutils module, and the dependencies do not always stay as up- 
to-date as one would like when you go through a process of debugging a  
Trilinos build.  From the PyTrilinos build directory, you might try a  
"make clean; make" and see if that helps.

On Mar 5, 2009, at 12:28 PM, Matt G wrote:

> Thanks to everyone with helping on my build issues, but it appears  
> we have hit one last snag:
>
> Making install in PyTrilinos
> make[2]: Entering directory `/homeA/home3/u27/mgoodman/build/ 
> trilinos/trilinos-9.0.2/packages/PyTrilinos'
> Making install in shared
> make[3]: Entering directory `/homeA/home3/u27/mgoodman/build/ 
> trilinos/trilinos-9.0.2/packages/PyTrilinos/shared'
> /home/u27/mgoodman/bin/python ./setup.py install --destdir=
>
> Extracting Makefile variables ... done
> /bin/mkdir -p /home/u27/mgoodman/lib
> /usr/bin/install -c libteuchos.so /home/u27/mgoodman/lib
> /usr/bin/install: cannot stat `libteuchos.so': No such file or  
> directory
> Traceback (most recent call last):
>   File "./setup.py", line 181, in <module>
>     main(command, destdir)
>   File "./setup.py", line 164, in main
>     builder.install(installDir)
>   File "../util/SharedUtils.py", line 361, in install
>     runCommand(" ".join([install, self.dylibName, installDir]))
>   File "../util/SharedUtils.py", line 97, in runCommand
>     if status: raise RuntimeError, "Exit status = %d" % status
> RuntimeError: Exit status = 256
> make[3]: *** [install] Error 1
> make[3]: Leaving directory `/homeA/home3/u27/mgoodman/build/trilinos/ 
> trilinos-9.0.2/packages/PyTrilinos/shared'
> make[2]: *** [install-recursive] Error 1
> make[2]: Leaving directory `/homeA/home3/u27/mgoodman/build/trilinos/ 
> trilinos-9.0.2/packages/PyTrilinos'
> make[1]: *** [install-recursive] Error 1
> make[1]: Leaving directory `/homeA/home3/u27/mgoodman/build/trilinos/ 
> trilinos-9.0.2/packages'
> make: *** [install-recursive] Error 1
>
> Looks like a Python config script can't find something?
> Any ideas?
>
> -Matthew Goodman
>
> <ATT00001.txt>

** Bill Spotz                                              **
** Sandia National Laboratories  Voice: (505)845-0170      **
** P.O. Box 5800                 Fax:   (505)284-0154      **
** Albuquerque, NM 87185-0370    Email: wfspotz at sandia.gov **







More information about the Trilinos-Users mailing list