[Trilinos-Users] New Bug

Matt G mgoodman at email.arizona.edu
Thu Mar 5 10:28:54 MST 2009

Thanks to everyone with helping on my build issues, but it appears we have
hit one last snag:

Making install in PyTrilinos
make[2]: Entering directory
Making install in shared
make[3]: Entering directory
/home/u27/mgoodman/bin/python ./setup.py install --destdir=

Extracting Makefile variables ... done
/bin/mkdir -p /home/u27/mgoodman/lib
/usr/bin/install -c libteuchos.so /home/u27/mgoodman/lib
/usr/bin/install: cannot stat `libteuchos.so': No such file or directory
Traceback (most recent call last):
  File "./setup.py", line 181, in <module>
    main(command, destdir)
  File "./setup.py", line 164, in main
  File "../util/SharedUtils.py", line 361, in install
    runCommand(" ".join([install, self.dylibName, installDir]))
  File "../util/SharedUtils.py", line 97, in runCommand
    if status: raise RuntimeError, "Exit status = %d" % status
RuntimeError: Exit status = 256
make[3]: *** [install] Error 1
make[3]: Leaving directory
make[2]: *** [install-recursive] Error 1
make[2]: Leaving directory
make[1]: *** [install-recursive] Error 1
make[1]: Leaving directory
make: *** [install-recursive] Error 1

Looks like a Python config script can't find something?
Any ideas?

-Matthew Goodman
-------------- next part --------------
An HTML attachment was scrubbed...
URL: http://software.sandia.gov/mailman/private/trilinos-users/attachments/20090305/3c263dae/attachment.html 

More information about the Trilinos-Users mailing list